Reaction Details
TargetTissue-type plasminogen activator
LigandBDBM50172832
Substrate/Competitorn/a
Meas. Tech.ChEMBL_320806 (CHEMBL884761)
Ki 96±n/a nM
Citation Deng, JZMcMasters, DRRabbat, PMWilliams, PDCoburn, CAYan, YKuo, LCLewis, SDLucas, BJKrueger, JAStrulovici, BVacca, JPLyle, TABurgey, CS Development of an oxazolopyridine series of dual thrombin/factor Xa inhibitors via structure-guided lead optimization. Bioorg Med Chem Lett15:4411-6 (2005) 
 
Tissue-type plasminogen activator
Name:Tissue-type plasminogen activator
Type:Enzyme
Mol. Mass.:62931.08
Organism:Homo sapiens (Human)
Description:n/a
Residue:562
BDBM50172832
NameBDBM50172832
Synonyms:2-(2-{2-[2-(5-Chloro-2-[1,2,4]triazol-1-yl-benzyl)-oxazolo[4,5-c]pyridin-4-ylamino]-ethyl}-piperidin-1-yl)-ethanol | CHEMBL197843
TypeSmall organic molecule
Emp. Form.C24H28ClN7O2
Mol. Mass.481.978
SMILESOCCN1CCCCC1CCNc1nccc2oc(Cc3cc(Cl)ccc3-n3cncn3)nc12