Reaction Details
TargetCoagulation factor X
LigandBDBM50172826
Substrate/Competitorn/a
Meas. Tech.ChEMBL_320803 (CHEMBL884758)
Ki 3.9±n/a nM
Citation Deng, JZMcMasters, DRRabbat, PMWilliams, PDCoburn, CAYan, YKuo, LCLewis, SDLucas, BJKrueger, JAStrulovici, BVacca, JPLyle, TABurgey, CS Development of an oxazolopyridine series of dual thrombin/factor Xa inhibitors via structure-guided lead optimization. Bioorg Med Chem Lett15:4411-6 (2005) 
 
Coagulation factor X
Name:Coagulation factor X
Type:Enzyme
Mol. Mass.:54726.60
Organism:Homo sapiens (Human)
Description:n/a
Residue:488
BDBM50172826
NameBDBM50172826
Synonyms:CHEMBL426101 | [2-(5-Chloro-2-[1,2,4]triazol-1-yl-benzyl)-oxazolo[4,5-c]pyridin-4-yl]-(2-piperidin-2-yl-ethyl)-amine
TypeSmall organic molecule
Emp. Form.C22H24ClN7O
Mol. Mass.437.925
SMILESClc1ccc(c(Cc2nc3c(NCCC4CCCCN4)nccc3o2)c1)-n1cncn1