Reaction Details
TargetCoagulation factor X
LigandBDBM50172841
Substrate/Competitorn/a
Meas. Tech.ChEMBL_320803 (CHEMBL884758)
Ki 2.2±n/a nM
Citation Deng, JZMcMasters, DRRabbat, PMWilliams, PDCoburn, CAYan, YKuo, LCLewis, SDLucas, BJKrueger, JAStrulovici, BVacca, JPLyle, TABurgey, CS Development of an oxazolopyridine series of dual thrombin/factor Xa inhibitors via structure-guided lead optimization. Bioorg Med Chem Lett15:4411-6 (2005) 
 
Coagulation factor X
Name:Coagulation factor X
Type:Enzyme
Mol. Mass.:54726.60
Organism:Homo sapiens (Human)
Description:n/a
Residue:488
BDBM50172841
NameBDBM50172841
Synonyms:(2-{2-[2-(5-Chloro-2-[1,2,4]triazol-1-yl-benzyl)-oxazolo[4,5-c]pyridin-4-ylamino]-ethyl}-piperidin-1-yl)-acetic acid ethyl ester | CHEMBL372194
TypeSmall organic molecule
Emp. Form.C26H30ClN7O3
Mol. Mass.524.015
SMILESCCOC(=O)CN1CCCCC1CCNc1nccc2oc(Cc3cc(Cl)ccc3-n3cncn3)nc12