Reaction Details
TargetProthrombin
LigandBDBM50172848
Substrate/Competitorn/a
Meas. Tech.ChEMBL_320755 (CHEMBL884569)
Ki 1.7±n/a nM
Citation Deng, JZMcMasters, DRRabbat, PMWilliams, PDCoburn, CAYan, YKuo, LCLewis, SDLucas, BJKrueger, JAStrulovici, BVacca, JPLyle, TABurgey, CS Development of an oxazolopyridine series of dual thrombin/factor Xa inhibitors via structure-guided lead optimization. Bioorg Med Chem Lett15:4411-6 (2005) 
 
Prothrombin
Name:Prothrombin
Type:Protein
Mol. Mass.:70029.57
Organism:Homo sapiens (Human)
Description:P00734
Residue:622
BDBM50172848
NameBDBM50172848
Synonyms:(2-Piperidin-2-yl-ethyl)-[2-(2-tetrazol-1-yl-benzyl)-oxazolo[4,5-c]pyridin-4-yl]-amine | CHEMBL194486
TypeSmall organic molecule
Emp. Form.C21H24N8O
Mol. Mass.404.4683
SMILESC(CC1CCCCN1)Nc1nccc2oc(Cc3ccccc3-n3cnnn3)nc12