Reaction Details
TargetProthrombin
LigandBDBM50172853
Substrate/Competitorn/a
Meas. Tech.ChEMBL_320755 (CHEMBL884569)
Ki 1.7±n/a nM
Citation Deng, JZMcMasters, DRRabbat, PMWilliams, PDCoburn, CAYan, YKuo, LCLewis, SDLucas, BJKrueger, JAStrulovici, BVacca, JPLyle, TABurgey, CS Development of an oxazolopyridine series of dual thrombin/factor Xa inhibitors via structure-guided lead optimization. Bioorg Med Chem Lett15:4411-6 (2005) 
 
Prothrombin
Name:Prothrombin
Type:Protein
Mol. Mass.:70029.57
Organism:Homo sapiens (Human)
Description:P00734
Residue:622
BDBM50172853
NameBDBM50172853
Synonyms:CHEMBL439678 | [2-(3-Chloro-benzyl)-oxazolo[4,5-c]pyridin-4-yl]-(2-piperidin-2-yl-ethyl)-amine
TypeSmall organic molecule
Emp. Form.C20H23ClN4O
Mol. Mass.370.876
SMILESClc1cccc(Cc2nc3c(NCCC4CCCCN4)nccc3o2)c1