Reaction Details
TargetSigma non-opioid intracellular receptor 1
LigandBDBM50172875
Substrate/Competitorn/a
Meas. Tech.ChEMBL_321541 (CHEMBL881479)
pH7.5±n/a
IC50 4.2±n/a nM
Commentsextracted
Citation Cazenave Gassiot, ACharton, JGirault-Mizzi, SGilleron, PDebreu-Fontaine, MASergheraert, CMelnyk, P Synthesis and pharmacological evaluation of Tic-hydantoin derivatives as selective sigma1 ligands. Part 2. Bioorg Med Chem Lett15:4828-32 (2005) 
 
Sigma non-opioid intracellular receptor 1
Name:Sigma non-opioid intracellular receptor 1
Type:Enzyme Catalytic Domain
Mol. Mass.:25124.85
Organism:Homo sapiens (Human)
Description:Q99720
Residue:223
BDBM50172875
NameBDBM50172875
Synonyms:(S)-2-[4-(Benzyl-methyl-amino)-butyl]-10,10a-dihydro-5H-imidazo[1,5-b]isoquinoline-1,3-dione | CHEMBL366167
TypeSmall organic molecule
Emp. Form.C23H27N3O2
Mol. Mass.377.4794
SMILESCN(CCCCn1c(O)c2Cc3ccccc3Cn2c1=O)Cc1ccccc1