Reaction Details
TargetSigma non-opioid intracellular receptor 1
LigandBDBM50172877
Substrate/Competitorn/a
Meas. Tech.ChEMBL_321533 (CHEMBL880593)
IC50 6.6±n/a nM
Citation Charton, JCazenave Gassiot, AGirault-Mizzi, SDebreu-Fontaine, MAMelnyk, PSergheraert, C Synthesis and pharmacological evaluation of Tic-hydantoin derivatives as selective sigma1 ligands. Part 1. Bioorg Med Chem Lett15:4833-7 (2005) 
 
Sigma non-opioid intracellular receptor 1
Name:Sigma non-opioid intracellular receptor 1
Type:Enzyme Catalytic Domain
Mol. Mass.:25124.85
Organism:Homo sapiens (Human)
Description:Q99720
Residue:223
BDBM50172877
NameBDBM50172877
Synonyms:(S)-2-(2-Piperidin-1-yl-ethyl)-10,10a-dihydro-5H-imidazo[1,5-b]isoquinoline-1,3-dione CHEMBL371741
TypeSmall organic molecule
Emp. Form.C18H23N3O2
Mol. Mass.313.3941
SMILESOc1c2Cc3ccccc3Cn2c(=O)n1CCN1CCCCC1