Reaction Details
TargetSigma non-opioid intracellular receptor 1
LigandBDBM50172915
Substrate/Competitorn/a
Meas. Tech.ChEMBL_321533 (CHEMBL880593)
IC50 77±n/a nM
Citation Charton, JCazenave Gassiot, AGirault-Mizzi, SDebreu-Fontaine, MAMelnyk, PSergheraert, C Synthesis and pharmacological evaluation of Tic-hydantoin derivatives as selective sigma1 ligands. Part 1. Bioorg Med Chem Lett15:4833-7 (2005) 
 
Sigma non-opioid intracellular receptor 1
Name:Sigma non-opioid intracellular receptor 1
Type:Enzyme Catalytic Domain
Mol. Mass.:25124.85
Organism:Homo sapiens (Human)
Description:Q99720
Residue:223
BDBM50172915
NameBDBM50172915
Synonyms:(S)-2-(2-Piperidin-1-yl-ethyl)-1,2,3,5,10,10a-hexahydro-imidazo[1,5-b]isoquinoline | CHEMBL383147
TypeSmall organic molecule
Emp. Form.C18H27N3
Mol. Mass.285.4271
SMILESC(CN1CCCCC1)N1C[C@@H]2Cc3ccccc3CN2C1