Reaction Details
TargetSigma non-opioid intracellular receptor 1
LigandBDBM50172911
Substrate/Competitorn/a
Meas. Tech.ChEMBL_321533 (CHEMBL880593)
IC50 66±n/a nM
Citation Charton, JCazenave Gassiot, AGirault-Mizzi, SDebreu-Fontaine, MAMelnyk, PSergheraert, C Synthesis and pharmacological evaluation of Tic-hydantoin derivatives as selective sigma1 ligands. Part 1. Bioorg Med Chem Lett15:4833-7 (2005) 
 
Sigma non-opioid intracellular receptor 1
Name:Sigma non-opioid intracellular receptor 1
Type:Enzyme Catalytic Domain
Mol. Mass.:25124.85
Organism:Homo sapiens (Human)
Description:Q99720
Residue:223
BDBM50172911
NameBDBM50172911
Synonyms:(S)-2-(3-Piperidin-1-yl-propyl)-9,9a-dihydro-imidazo[1,5-a]indole-1,3-dione | CHEMBL195302
TypeSmall organic molecule
Emp. Form.C18H23N3O2
Mol. Mass.313.3941
SMILESOc1c2Cc3ccccc3-n2c(=O)n1CCCN1CCCCC1