Reaction Details
TargetFarnesyl pyrophosphate synthase
LigandBDBM50173056
Substrate/Competitorn/a
Meas. Tech.ChEMBL_321435 (CHEMBL880243)
IC50 382±n/a nM
Citation Szajnman, SHRavaschino, ELDocampo, RRodriguez, JB Synthesis and biological evaluation of 1-amino-1,1-bisphosphonates derived from fatty acids against Trypanosoma cruzi targeting farnesyl pyrophosphate synthase. Bioorg Med Chem Lett15:4685-90 (2005) 
 
Farnesyl pyrophosphate synthase
Name:Farnesyl pyrophosphate synthase
Type:Enzyme
Mol. Mass.:48272.89
Organism:Homo sapiens (Human)
Description:P14324
Residue:419
BDBM50173056
NameBDBM50173056
Synonyms:(1-Amino-1-phosphono-hexyl)-phosphonic acid | CHEMBL198510
TypeSmall organic molecule
Emp. Form.C6H17NO6P2
Mol. Mass.261.1498
SMILESCCCCCC(N)(P(O)(O)=O)P(O)(O)=O