Reaction Details
TargetSerine/threonine-protein kinase mTOR
LigandBDBM15234
Substrate/Competitorn/a
Meas. Tech.ChEMBL_321140 (CHEMBL872196)
IC50 40±n/a nM
Citation Ding, HZhang, CWu, XYang, CZhang, XDing, JXie, Y Novel indole alpha-methylene-gamma-lactones as potent inhibitors for AKT-mTOR signaling pathway kinases. Bioorg Med Chem Lett15:4799-802 (2005) 
 
Serine/threonine-protein kinase mTOR
Name:Serine/threonine-protein kinase mTOR
Type:Rapamycin target protein
Mol. Mass.:288917.12
Organism:Homo sapiens (Human)
Description:P42345
Residue:2549
BDBM15234
NameBDBM15234
Synonyms:(1R,3R,5S,9R,18S)-18-(methoxymethyl)-1,5-dimethyl-6,11,16-trioxo-13,17-dioxapentacyclo[10.6.1.0^{2,10}.0^{5,9}.0^{15,19}]nonadeca-2(10),12(19),14-trien-3-yl acetate NSC221019 Wortmannin, Wm | cid_312145
TypeAntibiotic
Emp. Form.C23H24O8
Mol. Mass.428.4319
SMILES[H][C@@]12CCC(=O)[C@@]1(C)C[C@@H](OC(C)=O)C1=C2C(=O)c2occ3c2[C@]1(C)[C@@H](COC)OC3=O