Reaction Details
Target5-hydroxytryptamine receptor 1B
LigandBDBM50173097
Substrate/Competitorn/a
Meas. Tech.ChEMBL_320886 (CHEMBL884811)
Ki 28±n/a nM
Citation Huang, YBae, SARoth, BLLaruelle, M Synthesis of potent and selective serotonin 5-HT1B receptor ligands. Bioorg Med Chem Lett15:4786-9 (2005) 
 
5-hydroxytryptamine receptor 1B
Name:5-hydroxytryptamine receptor 1B
Type:G Protein-Coupled Receptor (GPCR)
Mol. Mass.:43579.17
Organism:Homo sapiens (Human)
Description:Receptor binding assays were performed using human clone stably expressed in CHO cells
Residue:390
BDBM50173097
NameBDBM50173097
Synonyms:4-(4-Trifluoromethyl-phenyl)-piperazine-1-carboxylic acid [4-methoxy-3-(4-methyl-piperazin-1-yl)-phenyl]-amide | CHEMBL196598
TypeSmall organic molecule
Emp. Form.C24H30F3N5O2
Mol. Mass.477.5225
SMILESCOc1ccc(NC(=O)N2CCN(CC2)c2ccc(cc2)C(F)(F)F)cc1N1CCN(C)CC1