Reaction Details
Target5-hydroxytryptamine receptor 1A
LigandBDBM50173091
Substrate/Competitorn/a
Meas. Tech.ChEMBL_320820 (CHEMBL872355)
Ki 53±n/a nM
Citation Huang, YBae, SARoth, BLLaruelle, M Synthesis of potent and selective serotonin 5-HT1B receptor ligands. Bioorg Med Chem Lett15:4786-9 (2005) 
 
5-hydroxytryptamine receptor 1A
Name:5-hydroxytryptamine receptor 1A
Type:n/a
Mol. Mass.:46122.49
Organism:Homo sapiens (Human)
Description:n/a
Residue:422
BDBM50173091
NameBDBM50173091
Synonyms:4-(4-Chloro-phenyl)-piperazine-1-carboxylic acid [4-methoxy-3-(4-methyl-piperazin-1-yl)-phenyl]-amide | CHEMBL372453
TypeSmall organic molecule
Emp. Form.C23H30ClN5O2
Mol. Mass.443.97
SMILESCOc1ccc(NC(=O)N2CCN(CC2)c2ccc(Cl)cc2)cc1N1CCN(C)CC1