Reaction Details
Target5-hydroxytryptamine receptor 1B
LigandBDBM50173098
Substrate/Competitorn/a
Meas. Tech.ChEMBL_320777 (CHEMBL884732)
Ki 2±n/a nM
Citation Huang, YBae, SARoth, BLLaruelle, M Synthesis of potent and selective serotonin 5-HT1B receptor ligands. Bioorg Med Chem Lett15:4786-9 (2005) 
 
5-hydroxytryptamine receptor 1B
Name:5-hydroxytryptamine receptor 1B
Type:G Protein-Coupled Receptor (GPCR)
Mol. Mass.:43579.17
Organism:Homo sapiens (Human)
Description:Receptor binding assays were performed using human clone stably expressed in CHO cells
Residue:390
BDBM50173098
NameBDBM50173098
Synonyms:4-(2-Methoxy-phenyl)-piperazine-1-carboxylic acid [4-methoxy-3-(4-methyl-piperazin-1-yl)-phenyl]-amide CHEMBL430500
TypeSmall organic molecule
Emp. Form.C24H33N5O3
Mol. Mass.439.5505
SMILESCOc1ccccc1N1CCN(CC1)C(=O)Nc1ccc(OC)c(c1)N1CCN(C)CC1