Reaction Details
Target5-hydroxytryptamine receptor 1D
LigandBDBM50173096
Substrate/Competitorn/a
Meas. Tech.ChEMBL_320822 (CHEMBL872357)
Ki 209±n/a nM
Citation Huang, YBae, SARoth, BLLaruelle, M Synthesis of potent and selective serotonin 5-HT1B receptor ligands. Bioorg Med Chem Lett15:4786-9 (2005) 
 
5-hydroxytryptamine receptor 1D
Name:5-hydroxytryptamine receptor 1D
Type:G Protein-Coupled Receptor (GPCR)
Mol. Mass.:41920.63
Organism:Homo sapiens (Human)
Description:Receptor binding assays were performed using human clone stably expressed in CHO cells.
Residue:377
BDBM50173096
NameBDBM50173096
Synonyms:4-Biphenyl-4-yl-piperazine-1-carboxylic acid [4-methoxy-3-(4-methyl-piperazin-1-yl)-phenyl]-amide | CHEMBL197408
TypeSmall organic molecule
Emp. Form.C29H35N5O2
Mol. Mass.485.6205
SMILESCOc1ccc(NC(=O)N2CCN(CC2)c2ccc(cc2)-c2ccccc2)cc1N1CCN(C)CC1