Reaction Details
TargetAdenosine receptor A2a
LigandBDBM50173187
Substrate/Competitorn/a
Meas. Tech.ChEMBL_320973 (CHEMBL885380)
Ki 240±n/a nM
Citation Dowling, JEVessels, JTHaque, SChang, HXvan Vloten, KKumaravel, GEngber, TJin, XPhadke, DWang, JAyyub, EPetter, RC Synthesis of [1,2,4]triazolo[1,5-a]pyrazines as adenosine A2A receptor antagonists. Bioorg Med Chem Lett15:4809-13 (2005) 
 
Adenosine receptor A2a
Name:Adenosine receptor A2a
Type:G Protein-Coupled Receptor (GPCR)
Mol. Mass.:45015.65
Organism:Rattus norvegicus (rat)
Description:Rat A2A receptors expressed in CHO cells.
Residue:410
BDBM50173187
NameBDBM50173187
Synonyms:CHEMBL194693 | [3-(8-Amino-2-furan-2-yl-[1,2,4]triazolo[1,5-a]pyrazin-6-yl)-phenyl]-morpholin-4-yl-methanone
TypeSmall organic molecule
Emp. Form.C20H18N6O3
Mol. Mass.390.3953
SMILESNc1nc(cn2nc(nc12)-c1ccco1)-c1cccc(c1)C(=O)N1CCOCC1