Reaction Details
TargetAdenosine receptor A2a
LigandBDBM50173197
Substrate/Competitorn/a
Meas. Tech.ChEMBL_320973 (CHEMBL885380)
Ki 160±n/a nM
Citation Dowling, JEVessels, JTHaque, SChang, HXvan Vloten, KKumaravel, GEngber, TJin, XPhadke, DWang, JAyyub, EPetter, RC Synthesis of [1,2,4]triazolo[1,5-a]pyrazines as adenosine A2A receptor antagonists. Bioorg Med Chem Lett15:4809-13 (2005) 
 
Adenosine receptor A2a
Name:Adenosine receptor A2a
Type:G Protein-Coupled Receptor (GPCR)
Mol. Mass.:45015.65
Organism:Rattus norvegicus (rat)
Description:Rat A2A receptors expressed in CHO cells.
Residue:410
BDBM50173197
NameBDBM50173197
Synonyms:CHEMBL370880 | N-[3-(8-Amino-2-furan-2-yl-[1,2,4]triazolo[1,5-a]pyrazin-6-yl)-phenyl]-acetamide
TypeSmall organic molecule
Emp. Form.C17H14N6O2
Mol. Mass.334.3321
SMILESCC(=O)Nc1cccc(c1)-c1cn2nc(nc2c(N)n1)-c1ccco1