Reaction Details
TargetAdenosine receptor A2a
LigandBDBM50173203
Substrate/Competitorn/a
Meas. Tech.ChEMBL_320973 (CHEMBL885380)
Ki 400±n/a nM
Citation Dowling, JEVessels, JTHaque, SChang, HXvan Vloten, KKumaravel, GEngber, TJin, XPhadke, DWang, JAyyub, EPetter, RC Synthesis of [1,2,4]triazolo[1,5-a]pyrazines as adenosine A2A receptor antagonists. Bioorg Med Chem Lett15:4809-13 (2005) 
 
Adenosine receptor A2a
Name:Adenosine receptor A2a
Type:G Protein-Coupled Receptor (GPCR)
Mol. Mass.:45015.65
Organism:Rattus norvegicus (rat)
Description:Rat A2A receptors expressed in CHO cells.
Residue:410
BDBM50173203
NameBDBM50173203
Synonyms:2,6-Di-furan-2-yl-[1,2,4]triazolo[1,5-a]pyrazin-8-ylamine | CHEMBL371118
TypeSmall organic molecule
Emp. Form.C13H9N5O2
Mol. Mass.267.2429
SMILESNc1nc(cn2nc(nc12)-c1ccco1)-c1ccco1