Reaction Details
TargetCollagenase 3
LigandBDBM50173221
Substrate/Competitorn/a
Meas. Tech.ChEMBL_321194 (CHEMBL882118)
IC50 3.4±n/a nM
Citation Li, JRush, TSLi, WDeVincentis, DDu, XHu, YThomason, JRXiang, JSSkotnicki, JSTam, SCunningham, KMChockalingam, PSMorris, EALevin, JI Synthesis and SAR of highly selective MMP-13 inhibitors. Bioorg Med Chem Lett15:4961-6 (2005) 
 
Collagenase 3
Name:Collagenase 3
Type:Enzyme
Mol. Mass.:53808.06
Organism:Homo sapiens (Human)
Description:P45452
Residue:471
BDBM50173221
NameBDBM50173221
Synonyms:(R)-2-{4'-[(5-Bromo-4-methoxy-3-methyl-benzofuran-2-carbonyl)-amino]-biphenyl-4-sulfonylamino}-3-methyl-butyric acid | CHEMBL199158
TypeSmall organic molecule
Emp. Form.C28H27BrN2O7S
Mol. Mass.615.492
SMILESCOc1c(Br)ccc2oc(C(=O)Nc3ccc(cc3)-c3ccc(cc3)S(=O)(=O)N[C@H](C(C)C)C(O)=O)c(C)c12