Reaction Details
TargetMu-type opioid receptor
LigandBDBM50173247
Substrate/Competitorn/a
Meas. Tech.ChEMBL_321477 (CHEMBL880418)
IC50 1110±n/a nM
Citation Bignan, GCBattista, KConnolly, PJOrsini, MJLiu, JMiddleton, SAReitz, AB Preparation of 3-spirocyclic indolin-2-ones as ligands for the ORL-1 receptor. Bioorg Med Chem Lett15:5022-6 (2005) 
 
Mu-type opioid receptor
Name:Mu-type opioid receptor
Type:G Protein-Coupled Receptor (GPCR)
Mol. Mass.:44789.51
Organism:Homo sapiens (Human)
Description:P35372
Residue:400
BDBM50173247
NameBDBM50173247
Synonyms:1'-cyclooctylmethylspiro[2,3-dihydro-1H-indole-3,4'-(hexahydropyridine)]-2-one | CHEMBL199248
TypeSmall organic molecule
Emp. Form.C21H30N2O
Mol. Mass.326.4757
SMILESO=C1Nc2ccccc2C11CCN(CC2CCCCCCC2)CC1