Reaction Details
TargetNociceptin receptor
LigandBDBM50173248
Substrate/Competitorn/a
Meas. Tech.ChEMBL_321553 (CHEMBL881967)
IC50 710±n/a nM
Citation Bignan, GCBattista, KConnolly, PJOrsini, MJLiu, JMiddleton, SAReitz, AB Preparation of 3-spirocyclic indolin-2-ones as ligands for the ORL-1 receptor. Bioorg Med Chem Lett15:5022-6 (2005) 
 
Nociceptin receptor
Name:Nociceptin receptor
Type:G Protein-Coupled Receptor (GPCR)
Mol. Mass.:40702.87
Organism:Homo sapiens (Human)
Description:P41146
Residue:370
BDBM50173248
NameBDBM50173248
Synonyms:CHEMBL373222 | methyl 2-[1'-(4-chlorobenzyl)-2-oxospiro[2,3-dihydro-1H-indole-3,4'-(hexahydropyridine)]-1-yl]acetate
TypeSmall organic molecule
Emp. Form.C22H23ClN2O3
Mol. Mass.398.883
SMILESCOC(=O)CN1C(=O)C2(CCN(Cc3ccc(Cl)cc3)CC2)c2ccccc12