Reaction Details
TargetNociceptin receptor
LigandBDBM50173270
Substrate/Competitorn/a
Meas. Tech.ChEMBL_321553 (CHEMBL881967)
IC50 1120±n/a nM
Citation Bignan, GCBattista, KConnolly, PJOrsini, MJLiu, JMiddleton, SAReitz, AB Preparation of 3-spirocyclic indolin-2-ones as ligands for the ORL-1 receptor. Bioorg Med Chem Lett15:5022-6 (2005) 
 
Nociceptin receptor
Name:Nociceptin receptor
Type:G Protein-Coupled Receptor (GPCR)
Mol. Mass.:40702.87
Organism:Homo sapiens (Human)
Description:P41146
Residue:370
BDBM50173270
NameBDBM50173270
Synonyms:CHEMBL370782 | methyl 2-[1'-cyclododecylmethyl-2-oxospiro[2,3-dihydro-1H-indole-3,4'-(hexahydropyridine)]-1-yl]acetate
TypeSmall organic molecule
Emp. Form.C28H42N2O3
Mol. Mass.454.6447
SMILESCOC(=O)CN1C(=O)C2(CCN(CC3CCCCCCCCCCC3)CC2)c2ccccc12