Reaction Details
TargetMu-type opioid receptor
LigandBDBM50173244
Substrate/Competitorn/a
Meas. Tech.ChEMBL_321477 (CHEMBL880418)
IC50 500±n/a nM
Citation Bignan, GCBattista, KConnolly, PJOrsini, MJLiu, JMiddleton, SAReitz, AB Preparation of 3-spirocyclic indolin-2-ones as ligands for the ORL-1 receptor. Bioorg Med Chem Lett15:5022-6 (2005) 
 
Mu-type opioid receptor
Name:Mu-type opioid receptor
Type:G Protein-Coupled Receptor (GPCR)
Mol. Mass.:44789.51
Organism:Homo sapiens (Human)
Description:P35372
Residue:400
BDBM50173244
NameBDBM50173244
Synonyms:1'-cyclooctylmethyl-1-{2-hydroxy-3-[2-(1,4-oxazinan-4-yl)ethylamino]propyl}spiro[2,3-dihydro-1H-indole-3,4'-(hexahydropyridine)]-2-one | CHEMBL370613
TypeSmall organic molecule
Emp. Form.C30H48N4O3
Mol. Mass.512.7271
SMILESOC(CNCCN1CCOCC1)CN1C(=O)C2(CCN(CC3CCCCCCC3)CC2)c2ccccc12