Reaction Details
TargetMu-type opioid receptor
LigandBDBM50173275
Substrate/Competitorn/a
Meas. Tech.ChEMBL_321477 (CHEMBL880418)
IC50 840.0±n/a nM
Citation Bignan, GCBattista, KConnolly, PJOrsini, MJLiu, JMiddleton, SAReitz, AB Preparation of 3-spirocyclic indolin-2-ones as ligands for the ORL-1 receptor. Bioorg Med Chem Lett15:5022-6 (2005) 
 
Mu-type opioid receptor
Name:Mu-type opioid receptor
Type:G Protein-Coupled Receptor (GPCR)
Mol. Mass.:44789.51
Organism:Homo sapiens (Human)
Description:P35372
Residue:400
BDBM50173275
NameBDBM50173275
Synonyms:1'-cyclooctylmethyl-1-(2-oxiranylmethyl)spiro[2,3-dihydro-1H-indole-3,4'-(hexahydropyridine)]-2-one | CHEMBL198867
TypeSmall organic molecule
Emp. Form.C24H34N2O2
Mol. Mass.382.539
SMILESO=C1N(CC2CO2)c2ccccc2C11CCN(CC2CCCCCCC2)CC1