Reaction Details
TargetNociceptin receptor
LigandBDBM50173274
Substrate/Competitorn/a
Meas. Tech.ChEMBL_321553 (CHEMBL881967)
IC50 600±n/a nM
Citation Bignan, GCBattista, KConnolly, PJOrsini, MJLiu, JMiddleton, SAReitz, AB Preparation of 3-spirocyclic indolin-2-ones as ligands for the ORL-1 receptor. Bioorg Med Chem Lett15:5022-6 (2005) 
 
Nociceptin receptor
Name:Nociceptin receptor
Type:G Protein-Coupled Receptor (GPCR)
Mol. Mass.:40702.87
Organism:Homo sapiens (Human)
Description:P41146
Residue:370
BDBM50173274
NameBDBM50173274
Synonyms:1'-cyclooctylmethyl-1-methyl-5-trifluoromethylspiro[2,3-dihydro-1H-indole-3,4'-(hexahydropyridine)]-2-one | CHEMBL198600
TypeSmall organic molecule
Emp. Form.C23H31F3N2O
Mol. Mass.408.5002
SMILESCN1C(=O)C2(CCN(CC3CCCCCCC3)CC2)c2cc(ccc12)C(F)(F)F