Reaction Details
TargetNociceptin receptor
LigandBDBM50173247
Substrate/Competitorn/a
Meas. Tech.ChEMBL_321553 (CHEMBL881967)
IC50 380±n/a nM
Citation Bignan, GCBattista, KConnolly, PJOrsini, MJLiu, JMiddleton, SAReitz, AB Preparation of 3-spirocyclic indolin-2-ones as ligands for the ORL-1 receptor. Bioorg Med Chem Lett15:5022-6 (2005) 
 
Nociceptin receptor
Name:Nociceptin receptor
Type:G Protein-Coupled Receptor (GPCR)
Mol. Mass.:40702.87
Organism:Homo sapiens (Human)
Description:P41146
Residue:370
BDBM50173247
NameBDBM50173247
Synonyms:1'-cyclooctylmethylspiro[2,3-dihydro-1H-indole-3,4'-(hexahydropyridine)]-2-one | CHEMBL199248
TypeSmall organic molecule
Emp. Form.C21H30N2O
Mol. Mass.326.4757
SMILESO=C1Nc2ccccc2C11CCN(CC2CCCCCCC2)CC1