Reaction Details
TargetNociceptin receptor
LigandBDBM50173275
Substrate/Competitorn/a
Meas. Tech.ChEMBL_321553 (CHEMBL881967)
IC50 83±n/a nM
Citation Bignan, GCBattista, KConnolly, PJOrsini, MJLiu, JMiddleton, SAReitz, AB Preparation of 3-spirocyclic indolin-2-ones as ligands for the ORL-1 receptor. Bioorg Med Chem Lett15:5022-6 (2005) 
 
Nociceptin receptor
Name:Nociceptin receptor
Type:G Protein-Coupled Receptor (GPCR)
Mol. Mass.:40702.87
Organism:Homo sapiens (Human)
Description:P41146
Residue:370
BDBM50173275
NameBDBM50173275
Synonyms:1'-cyclooctylmethyl-1-(2-oxiranylmethyl)spiro[2,3-dihydro-1H-indole-3,4'-(hexahydropyridine)]-2-one | CHEMBL198867
TypeSmall organic molecule
Emp. Form.C24H34N2O2
Mol. Mass.382.539
SMILESO=C1N(CC2CO2)c2ccccc2C11CCN(CC2CCCCCCC2)CC1