Reaction Details
TargetC-C chemokine receptor type 5
LigandBDBM50173393
Substrate/Competitorn/a
Meas. Tech.ChEMBL_321534 (CHEMBL880594)
IC50 7.1±n/a nM
Citation Cumming, JGCooper, AEGrime, KLogan, CJMcLaughlin, SOldfield, JShaw, JSTucker, HWinter, JWhittaker, D Modulators of the human CCR5 receptor. Part 2: SAR of substituted 1-(3,3-diphenylpropyl)-piperidinyl phenylacetamides. Bioorg Med Chem Lett15:5012-5 (2005) 
 
C-C chemokine receptor type 5
Name:C-C chemokine receptor type 5
Type:Enzyme
Mol. Mass.:40540.21
Organism:Homo sapiens (Human)
Description:P51681
Residue:352
BDBM50173393
NameBDBM50173393
Synonyms:4-[3-(4-{Ethyl-[2-(4-methanesulfonyl-phenyl)-acetyl]-amino}-piperidin-1-yl)-1-phenyl-propyl]-benzoic acid methyl ester | CHEMBL197680
TypeSmall organic molecule
Emp. Form.C33H40N2O5S
Mol. Mass.576.746
SMILESCCN(C1CCN(CCC(c2ccccc2)c2ccc(cc2)C(=O)OC)CC1)C(=O)Cc1ccc(cc1)S(C)(=O)=O