Reaction Details
TargetMelanin-concentrating hormone receptor 1
LigandBDBM50173453
Substrate/Competitorn/a
Meas. Tech.ChEMBL_321503 (CHEMBL880563)
IC50 19±n/a nM
Citation Kym, PRIyengar, RSouers, AJLynch, JKJudd, ASGao, JFreeman, JMulhern, MZhao, GVasudevan, AWodka, DBlackburn, CBrown, JChe, JLCullis, CLai, SJLaMarche, MJMarsilje, TRoses, JSells, TGeddes, BGovek, EPatane, MFry, DDayton, BDBrodjian, SFalls, DBrune, MBush, EShapiro, RKnourek-Segel, VFey, TMcDowell, CReinhart, GAPreusser, LCMarsh, KHernandez, LSham, HLCollins, CA Discovery and characterization of aminopiperidinecoumarin melanin concentrating hormone receptor 1 antagonists. J Med Chem48:5888-91 (2005) 
 
Melanin-concentrating hormone receptor 1
Name:Melanin-concentrating hormone receptor 1
Type:G Protein-Coupled Receptor (GPCR)
Mol. Mass.:45976.27
Organism:Homo sapiens (Human)
Description:Membranes from CHO-K1 cells stably expressing human MCH1R were used in assays.
Residue:422
BDBM50173453
NameBDBM50173453
Synonyms:6-Chloro-4-[1-(2,2-difluoro-benzo[1,3]dioxol-5-ylmethyl)-piperidin-4-ylamino]-chromen-2-one | CHEMBL194292
TypeSmall organic molecule
Emp. Form.C22H19ClF2N2O4
Mol. Mass.448.847
SMILESFC1(F)Oc2ccc(CN3CCC(CC3)Nc3cc(=O)oc4ccc(Cl)cc34)cc2O1