Reaction Details
TargetEstrogen receptor beta
LigandBDBM50173657
Substrate/Competitorn/a
Meas. Tech.ChEMBL_320908 (CHEMBL881235)
Ki 3.8±n/a nM
Citation Clegg, NJParuthiyil, SLeitman, DCScanlan, TS Differential response of estrogen receptor subtypes to 1,3-diarylindene and 2,3-diarylindene ligands. J Med Chem48:5989-6003 (2005) 
 
Estrogen receptor beta
Name:Estrogen receptor beta
Type:Protein
Mol. Mass.:59238.43
Organism:Homo sapiens (Human)
Description:Q92731
Residue:530
BDBM50173657
NameBDBM50173657
Synonyms:1-{4-[5-Hydroxy-2-(4-hydroxy-phenyl)-3H-inden-1-yl]-phenyl}-ethanone | CHEMBL370403
TypeSmall organic molecule
Emp. Form.C23H18O3
Mol. Mass.342.3872
SMILESCC(=O)c1ccc(cc1)C1=C(Cc2cc(O)ccc12)c1ccc(O)cc1