Reaction Details
TargetEstrogen receptor beta
LigandBDBM50173656
Substrate/Competitorn/a
Meas. Tech.ChEMBL_320908 (CHEMBL881235)
Ki 15±n/a nM
Citation Clegg, NJParuthiyil, SLeitman, DCScanlan, TS Differential response of estrogen receptor subtypes to 1,3-diarylindene and 2,3-diarylindene ligands. J Med Chem48:5989-6003 (2005) 
 
Estrogen receptor beta
Name:Estrogen receptor beta
Type:Protein
Mol. Mass.:59238.43
Organism:Homo sapiens (Human)
Description:Q92731
Residue:530
BDBM50173656
NameBDBM50173656
Synonyms:1-(4-Bromomethyl-phenyl)-2-(4-hydroxy-phenyl)-3H-inden-5-ol | CHEMBL372526
TypeSmall organic molecule
Emp. Form.C22H17BrO2
Mol. Mass.393.273
SMILESOc1ccc(cc1)C1=C(c2ccc(O)cc2C1)c1ccc(CBr)cc1