Reaction Details
TargetEstrogen receptor beta
LigandBDBM50173668
Substrate/Competitorn/a
Meas. Tech.ChEMBL_320908 (CHEMBL881235)
Ki 1.3±n/a nM
Citation Clegg, NJParuthiyil, SLeitman, DCScanlan, TS Differential response of estrogen receptor subtypes to 1,3-diarylindene and 2,3-diarylindene ligands. J Med Chem48:5989-6003 (2005) 
 
Estrogen receptor beta
Name:Estrogen receptor beta
Type:Protein
Mol. Mass.:59238.43
Organism:Homo sapiens (Human)
Description:Q92731
Residue:530
BDBM50173668
NameBDBM50173668
Synonyms:2-(4-Hydroxy-phenyl)-1-p-tolyl-3H-inden-5-ol | CHEMBL197188
TypeSmall organic molecule
Emp. Form.C22H18O2
Mol. Mass.314.3771
SMILESCc1ccc(cc1)C1=C(Cc2cc(O)ccc12)c1ccc(O)cc1