Reaction Details
TargetGamma-aminobutyric acid receptor subunit alpha-1/beta-3/gamma-2
LigandBDBM50173691
Substrate/Competitorn/a
Meas. Tech.ChEMBL_321025 (CHEMBL882866)
pH7.4±n/a
Ki 7±n/a nM
Commentsextracted
Citation van Niel, MBWilson, KAdkins, CHAtack, JRCastro, JLClarke, DEFletcher, SGerhard, UMackey, MMMalpas, SMaubach, KNewman, RO'Connor, DPillai, GVSimpson, PBThomas, SRMacLeod, AM A new pyridazine series of GABAA alpha5 ligands. J Med Chem48:6004-11 (2005) 
 
Gamma-aminobutyric acid receptor subunit alpha-1/beta-3/gamma-2
Name:Gamma-aminobutyric acid receptor subunit alpha-1/beta-3/gamma-2
Type:Protein
Mol. Mass.:n/a
Description:n/a
Components:This complex has 3 components.
Component 1
Name:Gamma-aminobutyric acid receptor subunit alpha-1
Synonyms:Benzodiazepine central GABA A Benzodiazepine liver GABA(A) receptor subunit alpha-1 GABA-A receptor GBRA1_HUMAN TBPS | agonist GABA site
Type:Protein
Mol. Mass.:51817.35
Organism:Homo sapiens (Human)
Description:P14867
Residue:456
Component 2
Name:Gamma-aminobutyric acid receptor subunit beta-3
Synonyms:GABA A receptor alpha-4/beta-3/gamma-2 GABA-A receptor GBRB3_HUMAN | agonist GABA site
Type:PROTEIN
Mol. Mass.:54130.51
Organism:Homo sapiens (Human)
Description:ChEMBL_448071
Residue:473
Component 3
Name:Gamma-aminobutyric acid receptor subunit gamma-2
Synonyms:GABA(A) receptor subunit gamma-2 GBRG2_HUMAN
Type:PROTEIN
Mol. Mass.:54172.74
Organism:Homo sapiens (Human)
Description:EBI_217
Residue:467
BDBM50173691
NameBDBM50173691
Synonyms:3-(6-Phenyl-pyridazin-4-yl)-benzonitrile | CHEMBL198509
TypeSmall organic molecule
Emp. Form.C17H11N3
Mol. Mass.257.2893
SMILESN#Cc1cccc(c1)-c1cnnc(c1)-c1ccccc1