Reaction Details
TargetPlasmepsin I
LigandBDBM50173749
Substrate/Competitorn/a
Meas. Tech.ChEMBL_321024 (CHEMBL882865)
Ki 11±n/a nM
Citation Ersmark, KNervall, MHamelink, EJanka, LKClemente, JCDunn, BMBlackman, MJSamuelsson, BAqvist, JHallberg, A Synthesis of malarial plasmepsin inhibitors and prediction of binding modes by molecular dynamics simulations. J Med Chem48:6090-106 (2005) 
 
Plasmepsin I
Name:Plasmepsin I
Type:Enzyme
Mol. Mass.:51463.30
Organism:Plasmodium falciparum
Description:n/a
Residue:452
BDBM50173749
NameBDBM50173749
Synonyms:(2R,3R,4R,5R)-2,5-Bis-((E)-3-bromo-allyloxy)-3,4-dihydroxy-6-oxo-6-[N'-(4-phenyl-butyryl)-hydrazino]-hexanoic acid ((1S,2R)-2-hydroxy-indan-1-yl)-amide | CHEMBL370422
TypeSmall organic molecule
Emp. Form.C31H37Br2N3O8
Mol. Mass.739.449
SMILESO[C@H]([C@@H](O)[C@@H](OC\C=C\Br)C(=O)N[C@@H]1[C@H](O)Cc2ccccc12)[C@@H](OC\C=C\Br)C(=O)NNC(=O)CCCc1ccccc1