Reaction Details
TargetReverse transcriptase/RNaseH
LigandBDBM50173820
Substrate/Competitorn/a
Meas. Tech.ChEMBL_321537 (CHEMBL880597)
IC50 900±n/a nM
Citation Deng, BLHartman, TLBuckheit, RWPannecouque, CDe Clercq, EFanwick, PECushman, M Synthesis, anti-HIV activity, and metabolic stability of new alkenyldiarylmethane HIV-1 non-nucleoside reverse transcriptase inhibitors. J Med Chem48:6140-55 (2005) 
 
Reverse transcriptase/RNaseH
Name:Reverse transcriptase/RNaseH
Type:PROTEIN
Mol. Mass.:65229.15
Organism:Human immunodeficiency virus 1
Description:ChEMBL_1473730
Residue:566
BDBM50173820
NameBDBM50173820
Synonyms:(Z)-6-(3-Fluoro-5-trifluoromethyl-phenyl)-6-(3-methoxy-7-methyl-benzo[d]isoxazol-5-yl)-hex-5-enoic acid methyl ester CHEMBL372175
TypeSmall organic molecule
Emp. Form.C23H21F4NO4
Mol. Mass.451.4108
SMILESCOC(=O)CCC\C=C(/c1cc(F)cc(c1)C(F)(F)F)c1cc(C)c2onc(OC)c2c1