Reaction Details
TargetReverse transcriptase/RNaseH
LigandBDBM50173812
Substrate/Competitorn/a
Meas. Tech.ChEMBL_321537 (CHEMBL880597)
IC50 55300±n/a nM
Citation Deng, BLHartman, TLBuckheit, RWPannecouque, CDe Clercq, EFanwick, PECushman, M Synthesis, anti-HIV activity, and metabolic stability of new alkenyldiarylmethane HIV-1 non-nucleoside reverse transcriptase inhibitors. J Med Chem48:6140-55 (2005) 
 
Reverse transcriptase/RNaseH
Name:Reverse transcriptase/RNaseH
Type:PROTEIN
Mol. Mass.:65229.15
Organism:Human immunodeficiency virus 1
Description:ChEMBL_1473730
Residue:566
BDBM50173812
NameBDBM50173812
Synonyms:5-[(E)-1-(3-Fluoro-5-trifluoromethyl-phenyl)-5-methoxycarbonyl-pent-1-enyl]-2-methoxy-3-methyl-benzoic acid methyl ester | CHEMBL194649
TypeSmall organic molecule
Emp. Form.C24H24F4O5
Mol. Mass.468.438
SMILESCOC(=O)CCC\C=C(\c1cc(F)cc(c1)C(F)(F)F)c1cc(C)c(OC)c(c1)C(=O)OC