Reaction Details
TargetReverse transcriptase/RNaseH
LigandBDBM50173808
Substrate/Competitorn/a
Meas. Tech.ChEMBL_321537 (CHEMBL880597)
IC50 5700±n/a nM
Citation Deng, BLHartman, TLBuckheit, RWPannecouque, CDe Clercq, EFanwick, PECushman, M Synthesis, anti-HIV activity, and metabolic stability of new alkenyldiarylmethane HIV-1 non-nucleoside reverse transcriptase inhibitors. J Med Chem48:6140-55 (2005) 
 
Reverse transcriptase/RNaseH
Name:Reverse transcriptase/RNaseH
Type:PROTEIN
Mol. Mass.:65229.15
Organism:Human immunodeficiency virus 1
Description:ChEMBL_1473730
Residue:566
BDBM50173808
NameBDBM50173808
Synonyms:(E)-6-(3-Cyano-phenyl)-6-(3-methoxy-7-methyl-benzo[d]isoxazol-5-yl)-hex-5-enoic acid methyl ester | CHEMBL198201
TypeSmall organic molecule
Emp. Form.C23H22N2O4
Mol. Mass.390.4318
SMILESCOC(=O)CCC\C=C(/c1cccc(c1)C#N)c1cc(C)c2onc(OC)c2c1