Reaction Details
TargetThyrotropin-releasing hormone receptor
LigandBDBM50173825
Substrate/Competitorn/a
Meas. Tech.ChEMBL_321008 (CHEMBL872292)
pH7.4±n/a
Ki>100000±n/a nM
Commentsextracted
Citation Kaur, NLu, XGershengorn, MCJain, R Thyrotropin-releasing hormone (TRH) analogues that exhibit selectivity to TRH receptor subtype 2. J Med Chem48:6162-5 (2005) 
 
Thyrotropin-releasing hormone receptor
Name:Thyrotropin-releasing hormone receptor
Type:PROTEIN
Mol. Mass.:46618.79
Organism:Rattus norvegicus
Description:ChEMBL_303571
Residue:412
BDBM50173825
NameBDBM50173825
Synonyms:1-[3-(2-isopropyl-1H-4-imidazolyl)-2-[5-oxo-(2S)-tetrahydro-1H-2-pyrrolylcarboxamido]-(2S)-propanoyl]-(2S)-tetrahydro-1H-2-pyrrolecarboxamide | CHEMBL381666
TypeSmall organic molecule
Emp. Form.C19H28N6O4
Mol. Mass.404.4634
SMILESCC(C)c1ncc(C[C@H](NC(=O)[C@@H]2CCC(=O)N2)C(=O)N2CCC[C@H]2C(N)=O)[nH]1