Reaction Details
TargetThyrotropin-releasing hormone receptor
LigandBDBM50072394
Substrate/Competitorn/a
Meas. Tech.ChEMBL_321032 (CHEMBL883664)
pH7.4±n/a
Ki 20±n/a nM
Commentsextracted
Citation Kaur, NLu, XGershengorn, MCJain, R Thyrotropin-releasing hormone (TRH) analogues that exhibit selectivity to TRH receptor subtype 2. J Med Chem48:6162-5 (2005) 
 
Thyrotropin-releasing hormone receptor
Name:Thyrotropin-releasing hormone receptor
Type:PROTEIN
Mol. Mass.:46618.79
Organism:Rattus norvegicus
Description:ChEMBL_303571
Residue:412
BDBM50072394
NameBDBM50072394
Synonyms:1-[3-(1H-4-imidazolyl)-2-(5-oxotetrahydro-1H-2-pyrrolylcarboxamido)propanoyl]tetrahydro-1H-2-pyrrolecarboxamide ABBOTT-38579 | PROTIRELIN
TypeSmall organic molecule
Emp. Form.C16H22N6O4
Mol. Mass.362.3837
SMILESNC(=O)[C@@H]1CCCN1C(=O)[C@H](Cc1cnc[nH]1)NC(=O)[C@@H]1CCC(=O)N1