Reaction Details
TargetProto-oncogene tyrosine-protein kinase Src
LigandBDBM50173832
Substrate/Competitorn/a
Meas. Tech.ChEMBL_326810 (CHEMBL860331)
IC50>400000±n/a nM
Citation Gavrin, LKGreen, NHu, YJanz, KKaila, NLi, HQTam, SYThomason, JRGopalsamy, ACiszewski, GCuozzo, JWHall, JPHsu, STelliez, JBLin, LL Inhibition of Tpl2 kinase and TNF-alpha production with 1,7-naphthyridine-3-carbonitriles: synthesis and structure-activity relationships. Bioorg Med Chem Lett15:5288-92 (2005) 
 
Proto-oncogene tyrosine-protein kinase Src
Name:Proto-oncogene tyrosine-protein kinase Src
Type:Protein
Mol. Mass.:59838.60
Organism:Homo sapiens (Human)
Description:P12931
Residue:536
BDBM50173832
NameBDBM50173832
Synonyms:4-(3-chloro-4-fluorophenylamino)-6-(pyridin-3-ylmethylamino)-1,7-naphthyridine-3-carbonitrile 4-[(3-chloro-4-fluorophenyl)amino]-6-{[(1R)-1-phenylethyl]amino}-[1,7]naphthyridine-3-carbonitril | CHEMBL200381
TypeSmall organic molecule
Emp. Form.C21H14ClFN6
Mol. Mass.404.827
SMILESFc1ccc(Nc2c(cnc3cnc(NCc4cccnc4)cc23)C#N)cc1Cl