Reaction Details
TargetMitogen-activated protein kinase kinase kinase 8
LigandBDBM29896
Substrate/Competitorn/a
Meas. Tech.ChEMBL_326807 (CHEMBL860389)
IC50 1200±n/a nM
Citation Gavrin, LKGreen, NHu, YJanz, KKaila, NLi, HQTam, SYThomason, JRGopalsamy, ACiszewski, GCuozzo, JWHall, JPHsu, STelliez, JBLin, LL Inhibition of Tpl2 kinase and TNF-alpha production with 1,7-naphthyridine-3-carbonitriles: synthesis and structure-activity relationships. Bioorg Med Chem Lett15:5288-92 (2005) 
 
Mitogen-activated protein kinase kinase kinase 8
Name:Mitogen-activated protein kinase kinase kinase 8
Type:Serine/threonine-protein kinase
Mol. Mass.:52916.89
Organism:Homo sapiens (Human)
Description:P41279
Residue:467
BDBM29896
NameBDBM29896
Synonyms:1,7-naphthyridine-3-carbonitrile, 1 | CHEMBL197538
TypeSmall organic molecule
Emp. Form.C21H20ClFN6O
Mol. Mass.426.875
SMILESFc1ccc(Nc2c(cnc3cnc(NCCN4CCOCC4)cc23)C#N)cc1Cl