Reaction Details
TargetMAP kinase-activated protein kinase 2
LigandBDBM29896
Substrate/Competitorn/a
Meas. Tech.ChEMBL_326811 (CHEMBL860428)
IC50>400000±n/a nM
Citation Gavrin, LKGreen, NHu, YJanz, KKaila, NLi, HQTam, SYThomason, JRGopalsamy, ACiszewski, GCuozzo, JWHall, JPHsu, STelliez, JBLin, LL Inhibition of Tpl2 kinase and TNF-alpha production with 1,7-naphthyridine-3-carbonitriles: synthesis and structure-activity relationships. Bioorg Med Chem Lett15:5288-92 (2005) 
 
MAP kinase-activated protein kinase 2
Name:MAP kinase-activated protein kinase 2
Type:Serine/threonine-protein kinase
Mol. Mass.:45579.87
Organism:Homo sapiens (Human)
Description:P49137
Residue:400
BDBM29896
NameBDBM29896
Synonyms:1,7-naphthyridine-3-carbonitrile, 1 | CHEMBL197538
TypeSmall organic molecule
Emp. Form.C21H20ClFN6O
Mol. Mass.426.875
SMILESFc1ccc(Nc2c(cnc3cnc(NCCN4CCOCC4)cc23)C#N)cc1Cl