Reaction Details
TargetDipeptidyl peptidase 4
LigandBDBM50173957
Substrate/Competitorn/a
Meas. Tech.ChEMBL_328423 (CHEMBL863964)
Ki 112±n/a nM
Citation Haffner, CDMcDougald, DLReister, SMThompson, BDConlee, CFang, JBass, JLenhard, JMCroom, DSecosky-Chang, MBTomaszek, TMcConn, DWells-Knecht, KJohnson, PR 2-Cyano-4-fluoro-1-thiovalylpyrrolidine analogues as potent inhibitors of DPP-IV. Bioorg Med Chem Lett15:5257-61 (2005) 
 
Dipeptidyl peptidase 4
Name:Dipeptidyl peptidase 4
Type:Enzyme
Mol. Mass.:88271.01
Organism:Homo sapiens (Human)
Description:P27487
Residue:766
BDBM50173957
NameBDBM50173957
Synonyms:(2S,4S)-1-((R)-3-(4-methoxybenzylsulfinyl)-2-amino-3-methylbutanoyl)-4-fluoropyrrolidine-2-carbonitrile | CHEMBL199744
TypeSmall organic molecule
Emp. Form.C18H24FN3O3S
Mol. Mass.381.465
SMILESCOc1ccc(CS(=O)C(C)(C)[C@H](N)C(=O)N2C[C@@H](F)C[C@H]2C#N)cc1