Reaction Details
TargetDipeptidyl peptidase 2
LigandBDBM50173976
Substrate/Competitorn/a
Meas. Tech.ChEMBL_328424 (CHEMBL863965)
Ki>22385±n/a nM
Citation Haffner, CDMcDougald, DLReister, SMThompson, BDConlee, CFang, JBass, JLenhard, JMCroom, DSecosky-Chang, MBTomaszek, TMcConn, DWells-Knecht, KJohnson, PR 2-Cyano-4-fluoro-1-thiovalylpyrrolidine analogues as potent inhibitors of DPP-IV. Bioorg Med Chem Lett15:5257-61 (2005) 
 
Dipeptidyl peptidase 2
Name:Dipeptidyl peptidase 2
Type:Protein
Mol. Mass.:54339.29
Organism:Homo sapiens (Human)
Description:Q9UHL4
Residue:492
BDBM50173976
NameBDBM50173976
Synonyms:(2S,4S)-1-((R)-2-amino-3-methyl-3-(pyridin-3-ylmethylthio)butanoyl)-4-fluoropyrrolidine-2-carbonitrile | CHEMBL199734
TypeSmall organic molecule
Emp. Form.C16H21FN4OS
Mol. Mass.336.428
SMILESCC(C)(SCc1cccnc1)[C@H](N)C(=O)N1C[C@@H](F)C[C@H]1C#N