Reaction Details
TargetDipeptidyl peptidase 2
LigandBDBM50173968
Substrate/Competitorn/a
Meas. Tech.ChEMBL_328424 (CHEMBL863965)
Ki>22385±n/a nM
Citation Haffner, CDMcDougald, DLReister, SMThompson, BDConlee, CFang, JBass, JLenhard, JMCroom, DSecosky-Chang, MBTomaszek, TMcConn, DWells-Knecht, KJohnson, PR 2-Cyano-4-fluoro-1-thiovalylpyrrolidine analogues as potent inhibitors of DPP-IV. Bioorg Med Chem Lett15:5257-61 (2005) 
 
Dipeptidyl peptidase 2
Name:Dipeptidyl peptidase 2
Type:Protein
Mol. Mass.:54339.29
Organism:Homo sapiens (Human)
Description:Q9UHL4
Residue:492
BDBM50173968
NameBDBM50173968
Synonyms:(R)-3-amino-4-((2S,4S)-2-cyano-4-fluoropyrrolidin-1-yl)-2-methyl-4-oxobutane-2-sulfonic acid | CHEMBL199891
TypeSmall organic molecule
Emp. Form.C10H16FN3O4S
Mol. Mass.293.315
SMILESCC(C)([C@H](N)C(=O)N1C[C@@H](F)C[C@H]1C#N)S(O)(=O)=O