Reaction Details
TargetDipeptidyl peptidase 4
LigandBDBM50173978
Substrate/Competitorn/a
Meas. Tech.ChEMBL_328423 (CHEMBL863964)
Ki 68±n/a nM
Citation Haffner, CDMcDougald, DLReister, SMThompson, BDConlee, CFang, JBass, JLenhard, JMCroom, DSecosky-Chang, MBTomaszek, TMcConn, DWells-Knecht, KJohnson, PR 2-Cyano-4-fluoro-1-thiovalylpyrrolidine analogues as potent inhibitors of DPP-IV. Bioorg Med Chem Lett15:5257-61 (2005) 
 
Dipeptidyl peptidase 4
Name:Dipeptidyl peptidase 4
Type:Enzyme
Mol. Mass.:88271.01
Organism:Homo sapiens (Human)
Description:P27487
Residue:766
BDBM50173978
NameBDBM50173978
Synonyms:(2S,4S)-1-((R)-3-(4-cyanobenzylsulfonyl)-2-amino-3-methylbutanoyl)-4-fluoropyrrolidine-2-carbonitrile | CHEMBL202036
TypeSmall organic molecule
Emp. Form.C18H21FN4O3S
Mol. Mass.392.448
SMILESCC(C)([C@H](N)C(=O)N1C[C@@H](F)C[C@H]1C#N)S(=O)(=O)Cc1ccc(cc1)C#N