Reaction Details
TargetDipeptidyl peptidase 2
LigandBDBM50173961
Substrate/Competitorn/a
Meas. Tech.ChEMBL_328424 (CHEMBL863965)
Ki 1066±n/a nM
Citation Haffner, CDMcDougald, DLReister, SMThompson, BDConlee, CFang, JBass, JLenhard, JMCroom, DSecosky-Chang, MBTomaszek, TMcConn, DWells-Knecht, KJohnson, PR 2-Cyano-4-fluoro-1-thiovalylpyrrolidine analogues as potent inhibitors of DPP-IV. Bioorg Med Chem Lett15:5257-61 (2005) 
 
Dipeptidyl peptidase 2
Name:Dipeptidyl peptidase 2
Type:Protein
Mol. Mass.:54339.29
Organism:Homo sapiens (Human)
Description:Q9UHL4
Residue:492
BDBM50173961
NameBDBM50173961
Synonyms:(2S,4S)-1-((R)-3-(3-phenoxybenzylthio)-2-amino-3-methylbutanoyl)-4-fluoropyrrolidine-2-carbonitrile | CHEMBL380785
TypeSmall organic molecule
Emp. Form.C23H26FN3O2S
Mol. Mass.427.535
SMILESCC(C)(SCc1cccc(Oc2ccccc2)c1)[C@H](N)C(=O)N1C[C@@H](F)C[C@H]1C#N