Reaction Details
TargetDipeptidyl peptidase 2
LigandBDBM50173977
Substrate/Competitorn/a
Meas. Tech.ChEMBL_328424 (CHEMBL863965)
Ki 701±n/a nM
Citation Haffner, CDMcDougald, DLReister, SMThompson, BDConlee, CFang, JBass, JLenhard, JMCroom, DSecosky-Chang, MBTomaszek, TMcConn, DWells-Knecht, KJohnson, PR 2-Cyano-4-fluoro-1-thiovalylpyrrolidine analogues as potent inhibitors of DPP-IV. Bioorg Med Chem Lett15:5257-61 (2005) 
 
Dipeptidyl peptidase 2
Name:Dipeptidyl peptidase 2
Type:Protein
Mol. Mass.:54339.29
Organism:Homo sapiens (Human)
Description:Q9UHL4
Residue:492
BDBM50173977
NameBDBM50173977
Synonyms:(2S,4S)-1-((R)-2-amino-3-(3-(4-fluorophenyl)propylthio)-3-methylbutanoyl)-4-fluoropyrrolidine-2-carbonitrile | CHEMBL199502
TypeSmall organic molecule
Emp. Form.C19H25F2N3OS
Mol. Mass.381.483
SMILESCC(C)(SCCCc1ccc(F)cc1)[C@H](N)C(=O)N1C[C@@H](F)C[C@H]1C#N