Reaction Details
TargetDipeptidyl peptidase 2
LigandBDBM50173979
Substrate/Competitorn/a
Meas. Tech.ChEMBL_328424 (CHEMBL863965)
Ki 14421±n/a nM
Citation Haffner, CDMcDougald, DLReister, SMThompson, BDConlee, CFang, JBass, JLenhard, JMCroom, DSecosky-Chang, MBTomaszek, TMcConn, DWells-Knecht, KJohnson, PR 2-Cyano-4-fluoro-1-thiovalylpyrrolidine analogues as potent inhibitors of DPP-IV. Bioorg Med Chem Lett15:5257-61 (2005) 
 
Dipeptidyl peptidase 2
Name:Dipeptidyl peptidase 2
Type:Protein
Mol. Mass.:54339.29
Organism:Homo sapiens (Human)
Description:Q9UHL4
Residue:492
BDBM50173979
NameBDBM50173979
Synonyms:(2S,4S)-1-((R)-2-amino-3-methyl-3-(phenethylthio)butanoyl)-4-fluoropyrrolidine-2-carbonitrile | CHEMBL198031
TypeSmall organic molecule
Emp. Form.C18H24FN3OS
Mol. Mass.349.466
SMILESCC(C)(SCCc1ccccc1)[C@H](N)C(=O)N1C[C@@H](F)C[C@H]1C#N