Reaction Details
TargetDipeptidyl peptidase 2
LigandBDBM50173984
Substrate/Competitorn/a
Meas. Tech.ChEMBL_328424 (CHEMBL863965)
Ki>22385±n/a nM
Citation Haffner, CDMcDougald, DLReister, SMThompson, BDConlee, CFang, JBass, JLenhard, JMCroom, DSecosky-Chang, MBTomaszek, TMcConn, DWells-Knecht, KJohnson, PR 2-Cyano-4-fluoro-1-thiovalylpyrrolidine analogues as potent inhibitors of DPP-IV. Bioorg Med Chem Lett15:5257-61 (2005) 
 
Dipeptidyl peptidase 2
Name:Dipeptidyl peptidase 2
Type:Protein
Mol. Mass.:54339.29
Organism:Homo sapiens (Human)
Description:Q9UHL4
Residue:492
BDBM50173984
NameBDBM50173984
Synonyms:(2S,4S)-1-((R)-3-(3-phenoxybenzylsulfonyl)-2-amino-3-methylbutanoyl)-4-fluoropyrrolidine-2-carbonitrile | CHEMBL369950
TypeSmall organic molecule
Emp. Form.C23H26FN3O4S
Mol. Mass.459.534
SMILESCC(C)([C@H](N)C(=O)N1C[C@@H](F)C[C@H]1C#N)S(=O)(=O)Cc1cccc(Oc2ccccc2)c1